Reaction Details
TargetNeuronal acetylcholine receptor subunit alpha-3/beta-2
LigandBDBM50001696
Substrate/Competitorn/a
Meas. Tech.ChEMBL_1337304 (CHEMBL3241028)
IC50 26±n/a nM
Citation Chang, YPBanerjee, JDowell, CWu, JGyanda, RHoughten, RAToll, LMcIntosh, JMArmishaw, CJ Discovery of a potent and selectivea3ß4 nicotinic acetylcholine receptor antagonist from ana-conotoxin synthetic combinatorial library. J Med Chem57:3511-21 (2014) 
 
Neuronal acetylcholine receptor subunit alpha-3/beta-2
Name:Neuronal acetylcholine receptor subunit alpha-3/beta-2
Type:Protein
Mol. Mass.:n/a
Description:n/a
Components:This complex has 2 components.
Component 1
Name:Neuronal acetylcholine receptor subunit alpha-3
Synonyms:ACHA3_RAT Chrna3
Type:Enzyme
Mol. Mass.:56995.52
Organism:Rattus norvegicus (Rat)
Description:P04757
Residue:499
Component 2
Name:Neuronal acetylcholine receptor subunit beta-2
Synonyms:ACHB2_RAT Chrnb2 Neuronal acetylcholine receptor non-alpha-1 chain
Type:Enzyme
Mol. Mass.:56910.32
Organism:Rattus norvegicus (Rat)
Description:P12390
Residue:500
BDBM50001696
NameBDBM50001696
Synonyms:CHEMBL3238023
TypeSmall organic molecule
Emp. Form.C54H81N13O17S4
Mol. Mass.1312.558
SMILES[H][C@@]12CCCN1C(=O)[C@]1([H])CCCN1C(=O)[C@@]([H])(NC(=O)[C@H](CO)NC(=O)[C@]1([H])CSSC[C@H](NC(=O)[C@H](Cc3ccc(O)cc3)NC(=O)[C@H](CC(C)C)NC(=O)[C@@H](NC(=O)[C@H](C)NC(=O)[C@]([H])(CSSC[C@H](NC(=O)CN)C(=O)N1)NC2=O)C(C)C)C(O)=O)[C@H](C)O