Reaction Details
TargetSerine/threonine-protein kinase VRK1
LigandBDBM50001733
Substrate/Competitorn/a
Meas. Tech.ChEMBL_1337676 (CHEMBL3242864)
IC50>10000±n/a nM
Citation Mahmoud, KAKrug, MWersig, TSlynko, ISchächtele, CTotzke, FSippl, WHilgeroth, A Discovery of 4-anilinoa-carbolines as novel Brk inhibitors. Bioorg Med Chem Lett24:1948-51 (2014) 
 
Serine/threonine-protein kinase VRK1
Name:Serine/threonine-protein kinase VRK1
Type:PROTEIN
Mol. Mass.:45490.12
Organism:Homo sapiens (Human)
Description:ChEMBL_1337676
Residue:396
BDBM50001733
NameBDBM50001733
Synonyms:CHEMBL3133821
TypeSmall organic molecule
Emp. Form.C17H13N3O
Mol. Mass.275.3046
SMILESOc1cccc(Nc2ccnc3[nH]c4ccccc4c23)c1