Reaction Details
TargetHistone-lysine N-methyltransferase EHMT2
LigandBDBM50001750
Substrate/Competitorn/a
Meas. Tech.ChEMBL_1338133 (CHEMBL3242000)
IC50 26400±n/a nM
Citation Kashyap, SSandler, JPeters, UMartinez, EJKapoor, TM Using 'biased-privileged' scaffolds to identify lysine methyltransferase inhibitors. Bioorg Med Chem22:2253-60 (2014) 
 
Histone-lysine N-methyltransferase EHMT2
Name:Histone-lysine N-methyltransferase EHMT2
Type:Enzyme
Mol. Mass.:132339.87
Organism:Homo sapiens (Human)
Description:Q96KQ7
Residue:1210
BDBM50001750
NameBDBM50001750
Synonyms:CHEMBL3238424
TypeSmall organic molecule
Emp. Form.C29H21F3N2O2
Mol. Mass.486.4844
SMILESOC(=O)c1cccc(NCc2cccc(c2)-n2ccc3c(cccc23)-c2ccc(cc2)C(F)(F)F)c1