Reaction Details
TargetGlucocorticoid receptor
LigandBDBM50001820
Substrate/Competitorn/a
Meas. Tech.ChEMBL_1338546 (CHEMBL3241423)
IC50 13±n/a nM
Citation Razavi, HRiether, DHarcken, CBentzien, JDinallo, RMSouza, DNelson, RMKukulka, AFadra-Khan, TNPack, EJZuvela-Jelaska, LPelletier, JPanzenbeck, MTorcellini, CAProudfoot, JRNabozny, GHThomson, DS Discovery of a potent and dissociated non-steroidal glucocorticoid receptor agonist containing an alkyl carbinol pharmacophore. Bioorg Med Chem Lett24:1934-40 (2014) 
 
Glucocorticoid receptor
Name:Glucocorticoid receptor
Type:Enzyme
Mol. Mass.:85656.87
Organism:Homo sapiens (Human)
Description:P04150
Residue:777
BDBM50001820
NameBDBM50001820
Synonyms:CHEMBL3233273
TypeSmall organic molecule
Emp. Form.C25H33FN2O2
Mol. Mass.412.5401
SMILESCCC(C)(C)C(O)(Cc1cc2ccncc2[nH]1)CC(C)(C)c1cc(F)ccc1OC