Reaction Details
TargetProgesterone receptor
LigandBDBM50001820
Substrate/Competitorn/a
Meas. Tech.ChEMBL_1338547 (CHEMBL3241424)
IC50>2000±n/a nM
Citation Razavi, HRiether, DHarcken, CBentzien, JDinallo, RMSouza, DNelson, RMKukulka, AFadra-Khan, TNPack, EJZuvela-Jelaska, LPelletier, JPanzenbeck, MTorcellini, CAProudfoot, JRNabozny, GHThomson, DS Discovery of a potent and dissociated non-steroidal glucocorticoid receptor agonist containing an alkyl carbinol pharmacophore. Bioorg Med Chem Lett24:1934-40 (2014) 
 
Progesterone receptor
Name:Progesterone receptor
Type:Protein
Mol. Mass.:98979.52
Organism:Homo sapiens (Human)
Description:P06401
Residue:933
BDBM50001820
NameBDBM50001820
Synonyms:CHEMBL3233273
TypeSmall organic molecule
Emp. Form.C25H33FN2O2
Mol. Mass.412.5401
SMILESCCC(C)(C)C(O)(Cc1cc2ccncc2[nH]1)CC(C)(C)c1cc(F)ccc1OC