Reaction Details
TargetProgesterone receptor
LigandBDBM50001865
Substrate/Competitorn/a
Meas. Tech.ChEMBL_1338547 (CHEMBL3241424)
IC50>2000±n/a nM
Citation Razavi, HRiether, DHarcken, CBentzien, JDinallo, RMSouza, DNelson, RMKukulka, AFadra-Khan, TNPack, EJZuvela-Jelaska, LPelletier, JPanzenbeck, MTorcellini, CAProudfoot, JRNabozny, GHThomson, DS Discovery of a potent and dissociated non-steroidal glucocorticoid receptor agonist containing an alkyl carbinol pharmacophore. Bioorg Med Chem Lett24:1934-40 (2014) 
 
Progesterone receptor
Name:Progesterone receptor
Type:Protein
Mol. Mass.:98979.52
Organism:Homo sapiens (Human)
Description:P06401
Residue:933
BDBM50001865
NameBDBM50001865
Synonyms:CHEMBL3233275
TypeSmall organic molecule
Emp. Form.C24H29FN2O2
Mol. Mass.396.4977
SMILESCOc1ccc(F)cc1C(C)(C)CC(O)(Cc1cc2ccncc2[nH]1)C1CCC1