Reaction Details
TargetGlucocorticoid receptor
LigandBDBM50001764
Substrate/Competitorn/a
Meas. Tech.ChEMBL_1338549 (CHEMBL3241426)
IC50 8.0±n/a nM
Citation Razavi, HRiether, DHarcken, CBentzien, JDinallo, RMSouza, DNelson, RMKukulka, AFadra-Khan, TNPack, EJZuvela-Jelaska, LPelletier, JPanzenbeck, MTorcellini, CAProudfoot, JRNabozny, GHThomson, DS Discovery of a potent and dissociated non-steroidal glucocorticoid receptor agonist containing an alkyl carbinol pharmacophore. Bioorg Med Chem Lett24:1934-40 (2014) 
 
Glucocorticoid receptor
Name:Glucocorticoid receptor
Type:Enzyme
Mol. Mass.:85656.87
Organism:Homo sapiens (Human)
Description:P04150
Residue:777
BDBM50001764
NameBDBM50001764
Synonyms:CHEMBL3233278
TypeSmall organic molecule
Emp. Form.C23H27FN2O2
Mol. Mass.382.4711
SMILESCOc1ccc(F)cc1C(C)(C)CC(O)(Cc1cc2cnccc2[nH]1)C1CC1