Reaction Details
TargetD(2) dopamine receptor
LigandBDBM50050467
Substrate/Competitorn/a
Meas. Tech.ChEMBL_1335160 (CHEMBL3239709)
Ki 7.5±n/a nM
Citation Xiao, JFree, RBBarnaeva, EConroy, JLDoyle, TMiller, BBryant-Genevier, MTaylor, MKHu, XDulcey, AESouthall, NFerrer, MTitus, SZheng, WSibley, DRMarugan, JJ Discovery, optimization, and characterization of novel D2 dopamine receptor selective antagonists. J Med Chem57:3450-63 (2014) 
 
D(2) dopamine receptor
Name:D(2) dopamine receptor
Type:Cell-surface receptors
Mol. Mass.:50647.10
Organism:Homo sapiens (Human)
Description:P14416
Residue:443
BDBM50050467
NameBDBM50050467
Synonyms:1-((1H-indol-3-yl)methyl)-4-(4-chlorophenyl)piperidin-4-ol 4-(4-Chloro-phenyl)-1-(1H-indol-3-ylmethyl)-piperidin-4-ol L-741626 | L741,626
TypeSmall organic molecule
Emp. Form.C20H21ClN2O
Mol. Mass.340.847
SMILESOC1(CCN(Cc2c[nH]c3ccccc23)CC1)c1ccc(Cl)cc1