Reaction Details
TargetD(2) dopamine receptor
LigandBDBM50003069
Substrate/Competitorn/a
Meas. Tech.ChEMBL_1335160 (CHEMBL3239709)
Ki 530±n/a nM
Citation Xiao, JFree, RBBarnaeva, EConroy, JLDoyle, TMiller, BBryant-Genevier, MTaylor, MKHu, XDulcey, AESouthall, NFerrer, MTitus, SZheng, WSibley, DRMarugan, JJ Discovery, optimization, and characterization of novel D2 dopamine receptor selective antagonists. J Med Chem57:3450-63 (2014) 
 
D(2) dopamine receptor
Name:D(2) dopamine receptor
Type:Cell-surface receptors
Mol. Mass.:50647.10
Organism:Homo sapiens (Human)
Description:P14416
Residue:443
BDBM50003069
NameBDBM50003069
Synonyms:CHEMBL3234538
TypeSmall organic molecule
Emp. Form.C24H21BrN2O3S
Mol. Mass.497.404
SMILESCCN1c2cc(ccc2[S@@+]([O-])c2ccccc2C1=O)C(=O)N[C@H](C)c1ccc(Br)cc1