Reaction Details
TargetHeat shock protein HSP 90-beta
LigandBDBM50003886
Substrate/Competitorn/a
Meas. Tech.ChEMBL_1336952 (CHEMBL3242260)
IC50 720±n/a nM
Citation Ernst, JTNeubert, TLiu, MSperry, SZuccola, HTurnbull, AFleck, BKargo, WWoody, LChiang, PTran, DChen, WSnyder, PAlcacio, TNezami, AReynolds, JAlvi, KGoulet, LStamos, D Identification of novel HSP90a/ß isoform selective inhibitors using structure-based drug design. demonstration of potential utility in treating CNS disorders such as Huntington's disease. J Med Chem57:3382-400 (2014) 
 
Heat shock protein HSP 90-beta
Name:Heat shock protein HSP 90-beta
Type:Molecular Chaperone
Mol. Mass.:83229.45
Organism:Homo sapiens (Human)
Description:P08238
Residue:724
BDBM50003886
NameBDBM50003886
Synonyms:CHEMBL3235337
TypeSmall organic molecule
Emp. Form.C24H32N4O3
Mol. Mass.424.5359
SMILESCOCCNc1cc(ccc1C(N)=O)-n1c2CN(C)CCc2c2c1CC(C)(C)CC2=O