Reaction Details
TargetEndoplasmin
LigandBDBM50003902
Substrate/Competitorn/a
Meas. Tech.ChEMBL_1336950 (CHEMBL3242258)
Ki>10000±n/a nM
Citation Ernst, JTNeubert, TLiu, MSperry, SZuccola, HTurnbull, AFleck, BKargo, WWoody, LChiang, PTran, DChen, WSnyder, PAlcacio, TNezami, AReynolds, JAlvi, KGoulet, LStamos, D Identification of novel HSP90a/ß isoform selective inhibitors using structure-based drug design. demonstration of potential utility in treating CNS disorders such as Huntington's disease. J Med Chem57:3382-400 (2014) 
 
Endoplasmin
Name:Endoplasmin
Type:Protein
Mol. Mass.:92417.36
Organism:Homo sapiens (Human)
Description:P14625
Residue:803
BDBM50003902
NameBDBM50003902
Synonyms:CHEMBL3235331
TypeSmall organic molecule
Emp. Form.C22H29N3O2
Mol. Mass.367.4846
SMILESCN1CCCC2C(C1)N(C1=C2C(=O)CC(C)(C)C1)c1ccc(cc1)C(N)=O