Reaction Details
TargetEndoplasmin
LigandBDBM50003888
Substrate/Competitorn/a
Meas. Tech.ChEMBL_1336950 (CHEMBL3242258)
Ki 3200±n/a nM
Citation Ernst, JTNeubert, TLiu, MSperry, SZuccola, HTurnbull, AFleck, BKargo, WWoody, LChiang, PTran, DChen, WSnyder, PAlcacio, TNezami, AReynolds, JAlvi, KGoulet, LStamos, D Identification of novel HSP90a/ß isoform selective inhibitors using structure-based drug design. demonstration of potential utility in treating CNS disorders such as Huntington's disease. J Med Chem57:3382-400 (2014) 
 
Endoplasmin
Name:Endoplasmin
Type:Protein
Mol. Mass.:92417.36
Organism:Homo sapiens (Human)
Description:P14625
Residue:803
BDBM50003888
NameBDBM50003888
Synonyms:CHEMBL3235339
TypeSmall organic molecule
Emp. Form.C24H32N4O2
Mol. Mass.408.5365
SMILESCCCNc1cc(ccc1C(N)=O)-n1c2CN(C)CCc2c2c1CC(C)(C)CC2=O