Reaction Details
TargetEndoplasmin
LigandBDBM50003900
Substrate/Competitorn/a
Meas. Tech.ChEMBL_1336950 (CHEMBL3242258)
Ki>10000±n/a nM
Citation Ernst, JTNeubert, TLiu, MSperry, SZuccola, HTurnbull, AFleck, BKargo, WWoody, LChiang, PTran, DChen, WSnyder, PAlcacio, TNezami, AReynolds, JAlvi, KGoulet, LStamos, D Identification of novel HSP90a/ß isoform selective inhibitors using structure-based drug design. demonstration of potential utility in treating CNS disorders such as Huntington's disease. J Med Chem57:3382-400 (2014) 
 
Endoplasmin
Name:Endoplasmin
Type:Protein
Mol. Mass.:92417.36
Organism:Homo sapiens (Human)
Description:P14625
Residue:803
BDBM50003900
NameBDBM50003900
Synonyms:CHEMBL3235350
TypeSmall organic molecule
Emp. Form.C27H35N3O2
Mol. Mass.433.5857
SMILESCC(C)Cc1cc(cc2CCNC(=O)c12)-n1c2CN(C)CCc2c2c1CC(C)(C)CC2=O