Reaction Details
TargetHeat shock protein HSP 90-alpha
LigandBDBM50003890
Substrate/Competitorn/a
Meas. Tech.ChEMBL_1336948 (CHEMBL3242256)
Ki 28±n/a nM
Citation Ernst, JTNeubert, TLiu, MSperry, SZuccola, HTurnbull, AFleck, BKargo, WWoody, LChiang, PTran, DChen, WSnyder, PAlcacio, TNezami, AReynolds, JAlvi, KGoulet, LStamos, D Identification of novel HSP90a/ß isoform selective inhibitors using structure-based drug design. demonstration of potential utility in treating CNS disorders such as Huntington's disease. J Med Chem57:3382-400 (2014) 
 
Heat shock protein HSP 90-alpha
Name:Heat shock protein HSP 90-alpha
Type:Molecular Chaperone
Mol. Mass.:84623.45
Organism:Homo sapiens (Human)
Description:P07900
Residue:732
BDBM50003890
NameBDBM50003890
Synonyms:CHEMBL3235341
TypeSmall organic molecule
Emp. Form.C23H28F2N4O2
Mol. Mass.430.4908
SMILESCN1CCc2c(C1)n(c1CC(C)(C)CC(=O)c21)-c1ccc(C(N)=O)c(NCC(F)F)c1