Reaction Details
TargetAurora kinase A
LigandBDBM50004210
Substrate/Competitorn/a
Meas. Tech.ChEMBL_1339461 (CHEMBL3243854)
IC50 113±n/a nM
Citation Luo, YDeng, YQWang, JLong, ZJTu, ZCPeng, WZhang, JQLiu, QLu, G Design, synthesis and bioevaluation of N-trisubstituted pyrimidine derivatives as potent aurora A kinase inhibitors. Eur J Med Chem78:65-71 (2014) 
 
Aurora kinase A
Name:Aurora kinase A
Type:Serine/threonine-protein kinase
Mol. Mass.:45830.98
Organism:Homo sapiens (Human)
Description:O14965
Residue:403
BDBM50004210
NameBDBM50004210
Synonyms:CHEMBL3237175
TypeSmall organic molecule
Emp. Form.C22H27N7O3
Mol. Mass.437.4949
SMILESCOC(=O)c1ccc(Nc2nc(Nc3cc(C)[nH]n3)cc(n2)N2C[C@H](C)O[C@H](C)C2)cc1