Reaction Details
TargetAurora kinase A
LigandBDBM50004213
Substrate/Competitorn/a
Meas. Tech.ChEMBL_1339461 (CHEMBL3243854)
IC50 228±n/a nM
Citation Luo, YDeng, YQWang, JLong, ZJTu, ZCPeng, WZhang, JQLiu, QLu, G Design, synthesis and bioevaluation of N-trisubstituted pyrimidine derivatives as potent aurora A kinase inhibitors. Eur J Med Chem78:65-71 (2014) 
 
Aurora kinase A
Name:Aurora kinase A
Type:Serine/threonine-protein kinase
Mol. Mass.:45830.98
Organism:Homo sapiens (Human)
Description:O14965
Residue:403
BDBM50004213
NameBDBM50004213
Synonyms:CHEMBL3237178
TypeSmall organic molecule
Emp. Form.C23H30N8O2
Mol. Mass.450.5367
SMILESCOC(=O)c1ccc(Nc2nc(NCCN3CCCCC3)cc(Nc3cc(C)[nH]n3)n2)cc1