Reaction Details
TargetAurora kinase A
LigandBDBM50004219
Substrate/Competitorn/a
Meas. Tech.ChEMBL_1339461 (CHEMBL3243854)
IC50 22±n/a nM
Citation Luo, YDeng, YQWang, JLong, ZJTu, ZCPeng, WZhang, JQLiu, QLu, G Design, synthesis and bioevaluation of N-trisubstituted pyrimidine derivatives as potent aurora A kinase inhibitors. Eur J Med Chem78:65-71 (2014) 
 
Aurora kinase A
Name:Aurora kinase A
Type:Serine/threonine-protein kinase
Mol. Mass.:45830.98
Organism:Homo sapiens (Human)
Description:O14965
Residue:403
BDBM50004219
NameBDBM50004219
Synonyms:CHEMBL3237184
TypeSmall organic molecule
Emp. Form.C20H26N8O
Mol. Mass.394.4734
SMILESCOc1cccc(Nc2nc(Nc3cc(C)[nH]n3)cc(n2)N2CCN(C)CC2)c1