Reaction Details
TargetAurora kinase A
LigandBDBM50004226
Substrate/Competitorn/a
Meas. Tech.ChEMBL_1339461 (CHEMBL3243854)
IC50 549±n/a nM
Citation Luo, YDeng, YQWang, JLong, ZJTu, ZCPeng, WZhang, JQLiu, QLu, G Design, synthesis and bioevaluation of N-trisubstituted pyrimidine derivatives as potent aurora A kinase inhibitors. Eur J Med Chem78:65-71 (2014) 
 
Aurora kinase A
Name:Aurora kinase A
Type:Serine/threonine-protein kinase
Mol. Mass.:45830.98
Organism:Homo sapiens (Human)
Description:O14965
Residue:403
BDBM50004226
NameBDBM50004226
Synonyms:CHEMBL3237163
TypeSmall organic molecule
Emp. Form.C26H32N10O2
Mol. Mass.516.5981
SMILESCN1CCN(CC1)c1cc(Nc2cc(C)[nH]n2)nc(Nc2ccc(cc2)N2CC(=O)N(CC2=O)C2CC2)n1