Reaction Details
TargetAurora kinase A
LigandBDBM50004232
Substrate/Competitorn/a
Meas. Tech.ChEMBL_1339461 (CHEMBL3243854)
IC50 11±n/a nM
Citation Luo, YDeng, YQWang, JLong, ZJTu, ZCPeng, WZhang, JQLiu, QLu, G Design, synthesis and bioevaluation of N-trisubstituted pyrimidine derivatives as potent aurora A kinase inhibitors. Eur J Med Chem78:65-71 (2014) 
 
Aurora kinase A
Name:Aurora kinase A
Type:Serine/threonine-protein kinase
Mol. Mass.:45830.98
Organism:Homo sapiens (Human)
Description:O14965
Residue:403
BDBM50004232
NameBDBM50004232
Synonyms:CHEMBL3237168
TypeSmall organic molecule
Emp. Form.C18H20N8O3
Mol. Mass.396.4032
SMILESCc1cc(Nc2cc(nc(Nc3ccc(cc3)[N+]([O-])=O)n2)N2CCOCC2)n[nH]1