Reaction Details
TargetCarbonic anhydrase 2
LigandBDBM50004257
Substrate/Competitorn/a
Meas. Tech.ChEMBL_1335178 (CHEMBL3239762)
IC50 9760±n/a nM
Citation Zaib, SSaeed, AStolte, KFlörke, UShahid, MIqbal, J New aminobenzenesulfonamide-thiourea conjugates: synthesis and carbonic anhydrase inhibition and docking studies. Eur J Med Chem78:140-50 (2014) 
 
Carbonic anhydrase 2
Name:Carbonic anhydrase 2
Type:Enzyme Catalytic Domain
Mol. Mass.:29115.93
Organism:Bos taurus
Description:n/a
Residue:260
BDBM50004257
NameBDBM50004257
Synonyms:CHEMBL3237497
TypeSmall organic molecule
Emp. Form.C12H11N3O4S2
Mol. Mass.325.363
SMILESNS(=O)(=O)c1cccc(NC(=S)NC(=O)c2ccco2)c1