Reaction Details
TargetCarbonic anhydrase 2
LigandBDBM50004262
Substrate/Competitorn/a
Meas. Tech.ChEMBL_1335178 (CHEMBL3239762)
IC50 11±n/a nM
Citation Zaib, SSaeed, AStolte, KFlörke, UShahid, MIqbal, J New aminobenzenesulfonamide-thiourea conjugates: synthesis and carbonic anhydrase inhibition and docking studies. Eur J Med Chem78:140-50 (2014) 
 
Carbonic anhydrase 2
Name:Carbonic anhydrase 2
Type:Enzyme Catalytic Domain
Mol. Mass.:29115.93
Organism:Bos taurus
Description:n/a
Residue:260
BDBM50004262
NameBDBM50004262
Synonyms:CHEMBL1438301
TypeSmall organic molecule
Emp. Form.C12H11N3O3S3
Mol. Mass.341.429
SMILESNS(=O)(=O)c1ccc(NC(=S)NC(=O)c2cccs2)cc1