Reaction Details
TargetHistone deacetylase 3
LigandBDBM50004760
Substrate/Competitorn/a
Meas. Tech.ChEMBL_1337841 (CHEMBL3240669)
IC50 5.5±n/a nM
Citation Li, XInks, ESLi, XHou, JChou, CJZhang, JJiang, YZhang, YXu, W Discovery of the first N-hydroxycinnamamide-based histone deacetylase 1/3 dual inhibitors with potent oral antitumor activity. J Med Chem57:3324-41 (2014) 
 
Histone deacetylase 3
Name:Histone deacetylase 3
Type:Enzyme
Mol. Mass.:48829.55
Organism:Homo sapiens (Human)
Description:O15379
Residue:428
BDBM50004760
NameBDBM50004760
Synonyms:CHEMBL3233703
TypeSmall organic molecule
Emp. Form.C27H24FN3O4
Mol. Mass.473.4956
SMILESONC(=O)\C=C\c1ccc(OC[C@H](Cc2c[nH]c3ccccc23)NC(=O)c2ccc(F)cc2)cc1