Reaction Details
TargetPolyamine deacetylase HDAC10
LigandBDBM50293361
Substrate/Competitorn/a
Meas. Tech.ChEMBL_1335260 (CHEMBL3238613)
IC50 91000±n/a nM
Citation Cincinelli, RMusso, LGiannini, GZuco, VDe Cesare, MZunino, FDallavalle, S Influence of the adamantyl moiety on the activity of biphenylacrylohydroxamic acid-based HDAC inhibitors. Eur J Med Chem79:251-9 (2014) 
 
Polyamine deacetylase HDAC10
Name:Polyamine deacetylase HDAC10
Type:Chromatin regulator; hydrolase; repressor
Mol. Mass.:71431.89
Organism:Homo sapiens (Human)
Description:Q969S8
Residue:669
BDBM50293361
NameBDBM50293361
Synonyms:CHEMBL561209 | N-Hydroxy-E-3-(4'-methoxybiphenyl-4-yl)-acrylamide
TypeSmall organic molecule
Emp. Form.C16H15NO3
Mol. Mass.269.2952
SMILESCOc1ccc(cc1)-c1ccc(\C=C\C(=O)NO)cc1