Reaction Details
TargetCannabinoid receptor 2
LigandBDBM50005998
Substrate/Competitorn/a
Meas. Tech.ChEMBL_1334808 (CHEMBL3238915)
EC50 1.000000±n/a nM
Citation Han, SThatte, JBuzard, DJJones, RM Therapeutic utility of cannabinoid receptor type 2 (CB(2)) selective agonists. Cell Chem Biol56:8224-56 (2013) 
 
Cannabinoid receptor 2
Name:Cannabinoid receptor 2
Type:G Protein-Coupled Receptor (GPCR)
Mol. Mass.:39690.94
Organism:Homo sapiens (Human)
Description:P34972
Residue:360
BDBM50005998
NameBDBM50005998
Synonyms:CHEMBL3234688
TypeSmall organic molecule
Emp. Form.C20H21FN2O3S2
Mol. Mass.420.521
SMILESFc1ccc(cc1)S(=O)(=O)N1CCSc2ccc(cc12)C(=O)NC1CCCC1