Reaction Details
TargetCannabinoid receptor 1
LigandBDBM50005998
Substrate/Competitorn/a
Meas. Tech.ChEMBL_1334809 (CHEMBL3238916)
EC50 10.0±n/a nM
Citation Han, SThatte, JBuzard, DJJones, RM Therapeutic utility of cannabinoid receptor type 2 (CB(2)) selective agonists. Cell Chem Biol56:8224-56 (2013) 
 
Cannabinoid receptor 1
Name:Cannabinoid receptor 1
Type:G Protein-Coupled Receptor (GPCR)
Mol. Mass.:52868.96
Organism:Homo sapiens (Human)
Description:P21554
Residue:472
BDBM50005998
NameBDBM50005998
Synonyms:CHEMBL3234688
TypeSmall organic molecule
Emp. Form.C20H21FN2O3S2
Mol. Mass.420.521
SMILESFc1ccc(cc1)S(=O)(=O)N1CCSc2ccc(cc12)C(=O)NC1CCCC1