Reaction Details
TargetCannabinoid receptor 2
LigandBDBM50006224
Substrate/Competitorn/a
Meas. Tech.ChEMBL_1334786 (CHEMBL3238893)
EC50 0.150000±n/a nM
Citation Han, SThatte, JBuzard, DJJones, RM Therapeutic utility of cannabinoid receptor type 2 (CB(2)) selective agonists. Cell Chem Biol56:8224-56 (2013) 
 
Cannabinoid receptor 2
Name:Cannabinoid receptor 2
Type:G Protein-Coupled Receptor (GPCR)
Mol. Mass.:39690.94
Organism:Homo sapiens (Human)
Description:P34972
Residue:360
BDBM50006224
NameBDBM50006224
Synonyms:CHEMBL3234674
TypeSmall organic molecule
Emp. Form.C20H27N3O3S
Mol. Mass.389.512
SMILESCC(C)(C)Cc1nc2cc(ccc2n1CC1CC1)S(=O)(=O)C1(CC1)C(N)=O