Reaction Details
TargetCannabinoid receptor 2
LigandBDBM50006228
Substrate/Competitorn/a
Meas. Tech.ChEMBL_1334811 (CHEMBL3238918)
EC50 173±n/a nM
Citation Han, SThatte, JBuzard, DJJones, RM Therapeutic utility of cannabinoid receptor type 2 (CB(2)) selective agonists. Cell Chem Biol56:8224-56 (2013) 
 
Cannabinoid receptor 2
Name:Cannabinoid receptor 2
Type:G Protein-Coupled Receptor (GPCR)
Mol. Mass.:39690.94
Organism:Homo sapiens (Human)
Description:P34972
Residue:360
BDBM50006228
NameBDBM50006228
Synonyms:CHEMBL3235056
TypeSmall organic molecule
Emp. Form.C18H21F3N4O2
Mol. Mass.382.3801
SMILESCC(C)(C)c1cc(NC(=O)[C@H]2CCCN2c2ccc(cn2)C(F)(F)F)no1