Reaction Details
TargetCannabinoid receptor 2
LigandBDBM50006256
Substrate/Competitorn/a
Meas. Tech.ChEMBL_1334662 (CHEMBL3239862)
EC50 785±n/a nM
Citation Han, SThatte, JBuzard, DJJones, RM Therapeutic utility of cannabinoid receptor type 2 (CB(2)) selective agonists. Cell Chem Biol56:8224-56 (2013) 
 
Cannabinoid receptor 2
Name:Cannabinoid receptor 2
Type:Enzyme
Mol. Mass.:39366.68
Organism:Rattus norvegicus (Rat)
Description:Q9QZN9
Residue:360
BDBM50006256
NameBDBM50006256
Synonyms:CHEMBL3234670
TypeSmall organic molecule
Emp. Form.C22H22IN3O3
Mol. Mass.503.3329
SMILESCN1CCCC[C@H]1Cn1cc(C(=O)c2cc(ccc2I)[N+]([O-])=O)c2ccccc12