Reaction Details
TargetCannabinoid receptor 1
LigandBDBM50006444
Substrate/Competitorn/a
Meas. Tech.ChEMBL_1334802 (CHEMBL3238909)
EC50>5000±n/a nM
Citation Han, SThatte, JBuzard, DJJones, RM Therapeutic utility of cannabinoid receptor type 2 (CB(2)) selective agonists. Cell Chem Biol56:8224-56 (2013) 
 
Cannabinoid receptor 1
Name:Cannabinoid receptor 1
Type:G Protein-Coupled Receptor (GPCR)
Mol. Mass.:52868.96
Organism:Homo sapiens (Human)
Description:P21554
Residue:472
BDBM50006444
NameBDBM50006444
Synonyms:CHEMBL3233029
TypeSmall organic molecule
Emp. Form.C25H28FN3O2S
Mol. Mass.453.572
SMILESC[C@H](NS(=O)(=O)\C=C\c1n[nH]c2[C@@H](Cc3cccc(F)c3)CCCCc12)c1ccccc1