Reaction Details
TargetCannabinoid receptor 2
LigandBDBM50116851
Substrate/Competitorn/a
Meas. Tech.ChEMBL_1334657 (CHEMBL3239857)
Ki 8.0±n/a nM
Citation Han, SThatte, JBuzard, DJJones, RM Therapeutic utility of cannabinoid receptor type 2 (CB(2)) selective agonists. Cell Chem Biol56:8224-56 (2013) 
 
Cannabinoid receptor 2
Name:Cannabinoid receptor 2
Type:G Protein-Coupled Receptor (GPCR)
Mol. Mass.:39690.94
Organism:Homo sapiens (Human)
Description:P34972
Residue:360
BDBM50116851
NameBDBM50116851
Synonyms:(S)-2-{[7-Methoxy-2-methyl-1-(2-morpholin-4-yl-ethyl)-1H-indole-3-carbonyl]-amino}-3-phenyl-propionic acid methyl ester | CHEMBL311690
TypeSmall organic molecule
Emp. Form.C27H33N3O5
Mol. Mass.479.568
SMILESCOC(=O)[C@H](Cc1ccccc1)NC(=O)c1c(C)n(CCN2CCOCC2)c2c(OC)cccc12