Reaction Details
TargetCannabinoid receptor 1
LigandBDBM50006107
Substrate/Competitorn/a
Meas. Tech.ChEMBL_1334790 (CHEMBL3238897)
EC50>10000±n/a nM
Citation Han, SThatte, JBuzard, DJJones, RM Therapeutic utility of cannabinoid receptor type 2 (CB(2)) selective agonists. Cell Chem Biol56:8224-56 (2013) 
 
Cannabinoid receptor 1
Name:Cannabinoid receptor 1
Type:G Protein-Coupled Receptor (GPCR)
Mol. Mass.:52868.96
Organism:Homo sapiens (Human)
Description:P21554
Residue:472
BDBM50006107
NameBDBM50006107
Synonyms:CHEMBL3234679
TypeSmall organic molecule
Emp. Form.C22H31N5O2
Mol. Mass.397.5138
SMILESCNC(=O)[C@@H](NC(=O)c1nc(-c2ccccc2)n2CCCN(C)Cc12)C(C)(C)C