Reaction Details
TargetCannabinoid receptor 2
LigandBDBM50335934
Substrate/Competitorn/a
Meas. Tech.ChEMBL_1334631 (CHEMBL3239831)
Ki 11±n/a nM
Citation Han, SThatte, JBuzard, DJJones, RM Therapeutic utility of cannabinoid receptor type 2 (CB(2)) selective agonists. Cell Chem Biol56:8224-56 (2013) 
 
Cannabinoid receptor 2
Name:Cannabinoid receptor 2
Type:G Protein-Coupled Receptor (GPCR)
Mol. Mass.:39690.94
Organism:Homo sapiens (Human)
Description:P34972
Residue:360
BDBM50335934
NameBDBM50335934
Synonyms:(6aR,10aR)-3-(6-cyano-2-methylhexan-2-yl)-6,6,9-trimethyl-6a,7,10,10a-tetrahydro-6H-benzo[c]chromen-1-yl 4-morpholinobutanoate | CHEMBL1668516
TypeSmall organic molecule
Emp. Form.C32H46N2O4
Mol. Mass.522.7186
SMILESCC1=CC[C@@H]2[C@@H](C1)c1c(OC(=O)CCCN3CCOCC3)cc(cc1OC2(C)C)C(C)(C)CCCCC#N