Reaction Details
TargetCannabinoid receptor 2
LigandBDBM50006447
Substrate/Competitorn/a
Meas. Tech.ChEMBL_1334788 (CHEMBL3238895)
EC50 11±n/a nM
Citation Han, SThatte, JBuzard, DJJones, RM Therapeutic utility of cannabinoid receptor type 2 (CB(2)) selective agonists. Cell Chem Biol56:8224-56 (2013) 
 
Cannabinoid receptor 2
Name:Cannabinoid receptor 2
Type:G Protein-Coupled Receptor (GPCR)
Mol. Mass.:39690.94
Organism:Homo sapiens (Human)
Description:P34972
Residue:360
BDBM50006447
NameBDBM50006447
Synonyms:CHEMBL3234702 US11084810, Example 2 in WO2010036630 | US11725004, Example 2 in WO2010036630
TypeSmall organic molecule
Emp. Form.C16H26N2O6S
Mol. Mass.374.452
SMILESCC(C)(CO)c1cc(NC(=O)C(C)(C)S(=O)(=O)C2CCOCC2)on1