Reaction Details
TargetCannabinoid receptor 2
LigandBDBM50287940
Substrate/Competitorn/a
Meas. Tech.ChEMBL_1334623 (CHEMBL3239823)
Ki 19±n/a nM
Citation Han, SThatte, JBuzard, DJJones, RM Therapeutic utility of cannabinoid receptor type 2 (CB(2)) selective agonists. Cell Chem Biol56:8224-56 (2013) 
 
Cannabinoid receptor 2
Name:Cannabinoid receptor 2
Type:G Protein-Coupled Receptor (GPCR)
Mol. Mass.:39690.94
Organism:Homo sapiens (Human)
Description:P34972
Residue:360
BDBM50287940
NameBDBM50287940
Synonyms:(6aR,10aR)-3-(1,1-Dimethyl-heptyl)-1-methoxy-6,6-dimethyl-9-methylene-6a,7,8,9,10,10a-hexahydro-6H-benzo[c]chromene | CHEMBL294013
TypeSmall organic molecule
Emp. Form.C26H40O2
Mol. Mass.384.5946
SMILESCCCCCCC(C)(C)c1cc(OC)c2[C@@H]3CC(=C)CC[C@H]3C(C)(C)Oc2c1