Reaction Details
TargetCannabinoid receptor 2
LigandBDBM50006249
Substrate/Competitorn/a
Meas. Tech.ChEMBL_1334806 (CHEMBL3238913)
EC50 22±n/a nM
Citation Han, SThatte, JBuzard, DJJones, RM Therapeutic utility of cannabinoid receptor type 2 (CB(2)) selective agonists. Cell Chem Biol56:8224-56 (2013) 
 
Cannabinoid receptor 2
Name:Cannabinoid receptor 2
Type:G Protein-Coupled Receptor (GPCR)
Mol. Mass.:39690.94
Organism:Homo sapiens (Human)
Description:P34972
Residue:360
BDBM50006249
NameBDBM50006249
Synonyms:CHEMBL3234686
TypeSmall organic molecule
Emp. Form.C20H25ClN6O
Mol. Mass.400.905
SMILESCC(CO)n1c(nc2c(nc(C)nc12)N1CCN(C)CC1)-c1ccccc1Cl