Reaction Details
TargetCannabinoid receptor 1
LigandBDBM50006261
Substrate/Competitorn/a
Meas. Tech.ChEMBL_1334816 (CHEMBL3238923)
EC50>27000±n/a nM
Citation Han, SThatte, JBuzard, DJJones, RM Therapeutic utility of cannabinoid receptor type 2 (CB(2)) selective agonists. Cell Chem Biol56:8224-56 (2013) 
 
Cannabinoid receptor 1
Name:Cannabinoid receptor 1
Type:G Protein-Coupled Receptor (GPCR)
Mol. Mass.:52868.96
Organism:Homo sapiens (Human)
Description:P21554
Residue:472
BDBM50006261
NameBDBM50006261
Synonyms:CHEMBL3234698
TypeSmall organic molecule
Emp. Form.C25H32F3N3O4
Mol. Mass.495.5345
SMILESCn1c(c\c(=N/C(=O)c2cc(ccc2OCC(C)(C)O)C(F)(F)F)n1C[C@H]1CCCO1)C1(C)CC1