Reaction Details
TargetCannabinoid receptor 2
LigandBDBM50244215
Substrate/Competitorn/a
Meas. Tech.ChEMBL_1334657 (CHEMBL3239857)
Ki 38±n/a nM
Citation Han, SThatte, JBuzard, DJJones, RM Therapeutic utility of cannabinoid receptor type 2 (CB(2)) selective agonists. Cell Chem Biol56:8224-56 (2013) 
 
Cannabinoid receptor 2
Name:Cannabinoid receptor 2
Type:G Protein-Coupled Receptor (GPCR)
Mol. Mass.:39690.94
Organism:Homo sapiens (Human)
Description:P34972
Residue:360
BDBM50244215
NameBDBM50244215
Synonyms:2-(4-ethoxybenzyl)-1-(2-(dimethylamino)ethyl)-N,N-diethyl-1H-benzo[d]imidazole-5-carboxamide | CHEMBL458143
TypeSmall organic molecule
Emp. Form.C25H34N4O2
Mol. Mass.422.5631
SMILESCCOc1ccc(Cc2nc3cc(ccc3n2CCN(C)C)C(=O)N(CC)CC)cc1