Reaction Details
TargetHistamine H4 receptor
LigandBDBM50006743
Substrate/Competitorn/a
Meas. Tech.ChEMBL_1336216 (CHEMBL3241464)
Ki 1.1±n/a nM
Citation Savall, BMChavez, FTays, KDunford, PJCowden, JMHack, MDWolin, RLThurmond, RLEdwards, JP Discovery and SAR of 6-alkyl-2,4-diaminopyrimidines as histamine H4 receptor antagonists. J Med Chem57:2429-39 (2014) 
 
Histamine H4 receptor
Name:Histamine H4 receptor
Type:G Protein-Coupled Receptor (GPCR)
Mol. Mass.:44517.02
Organism:Homo sapiens (Human)
Description:Binding assays were using CHO cells stably expressing hH4R receptors.
Residue:390
BDBM50006743
NameBDBM50006743
Synonyms:CHEMBL3236554
TypeSmall organic molecule
Emp. Form.C14H23N5
Mol. Mass.261.3659
SMILESCN[C@@H]1CCN(C1)c1cc(nc(N)n1)C1CCCC1