Reaction Details
TargetHistamine H4 receptor
LigandBDBM50006750
Substrate/Competitorn/a
Meas. Tech.ChEMBL_1336216 (CHEMBL3241464)
Ki 2.9±n/a nM
Citation Savall, BMChavez, FTays, KDunford, PJCowden, JMHack, MDWolin, RLThurmond, RLEdwards, JP Discovery and SAR of 6-alkyl-2,4-diaminopyrimidines as histamine H4 receptor antagonists. J Med Chem57:2429-39 (2014) 
 
Histamine H4 receptor
Name:Histamine H4 receptor
Type:G Protein-Coupled Receptor (GPCR)
Mol. Mass.:44517.02
Organism:Homo sapiens (Human)
Description:Binding assays were using CHO cells stably expressing hH4R receptors.
Residue:390
BDBM50006750
NameBDBM50006750
Synonyms:CHEMBL3236561
TypeSmall organic molecule
Emp. Form.C15H23N5
Mol. Mass.273.3766
SMILES[H][C@]12CCN[C@@]1([H])CN(C2)c1cc(nc(N)n1)C1CCCC1