Reaction Details
TargetKelch-like ECH-associated protein 1
LigandBDBM50006930
Substrate/Competitorn/a
Meas. Tech.ChEMBL_1337093 (CHEMBL3242827)
Kd 16±n/a nM
Citation Jiang, ZYLu, MCXu, LLYang, TTXi, MYXu, XLGuo, XKZhang, XJYou, QDSun, HP Discovery of potent Keap1-Nrf2 protein-protein interaction inhibitor based on molecular binding determinants analysis. J Med Chem57:2736-45 (2014) 
 
Kelch-like ECH-associated protein 1
Name:Kelch-like ECH-associated protein 1
Type:PROTEIN
Mol. Mass.:69664.53
Organism:Homo sapiens (Human)
Description:ChEMBL_107924
Residue:624
BDBM50006930
NameBDBM50006930
Synonyms:CHEMBL3237244
TypeSmall organic molecule
Emp. Form.C67H81N11O23S
Mol. Mass.1440.485
SMILESCC(C)C[C@H](NC(=O)[C@H](Cc1ccccc1)NC(=O)[C@H](CCC(O)=O)NC(=O)CNC(=O)[C@@H](NC(=O)[C@H](CCC(O)=O)NC(=O)[C@H](CCC(O)=O)NC(=O)[C@H](CC(O)=O)NC(=O)[C@H](CC(C)C)NC(=S)Nc1ccc2c(c1)C(=O)OC21c2ccc(O)cc2Oc2cc(O)ccc12)[C@@H](C)O)C(N)=O