Reaction Details
TargetKelch-like ECH-associated protein 1
LigandBDBM50006932
Substrate/Competitorn/a
Meas. Tech.ChEMBL_1337095 (CHEMBL3242829)
EC50 29±n/a nM
Citation Jiang, ZYLu, MCXu, LLYang, TTXi, MYXu, XLGuo, XKZhang, XJYou, QDSun, HP Discovery of potent Keap1-Nrf2 protein-protein interaction inhibitor based on molecular binding determinants analysis. J Med Chem57:2736-45 (2014) 
 
Kelch-like ECH-associated protein 1
Name:Kelch-like ECH-associated protein 1
Type:PROTEIN
Mol. Mass.:69664.53
Organism:Homo sapiens (Human)
Description:ChEMBL_107924
Residue:624
BDBM50006932
NameBDBM50006932
Synonyms:CHEMBL3237245
TypeSmall organic molecule
Emp. Form.C28H26N2O10S2
Mol. Mass.614.643
SMILESCOc1ccc(cc1)S(=O)(=O)N(CC(O)=O)c1ccc(N(CC(O)=O)S(=O)(=O)c2ccc(OC)cc2)c2ccccc12