Reaction Details
TargetProteasome subunit beta type-5
LigandBDBM50434763
Substrate/Competitorn/a
Meas. Tech.ChEMBL_1334922 (CHEMBL3239238)
Ki 440±n/a nM
Citation Scarbaci, KTroiano, VMicale, NEttari, RTamborini, LDi Giovanni, CCerchia, CGrasso, SNovellino, ESchirmeister, TLavecchia, AZappalą, M Identification of a new series of amides as non-covalent proteasome inhibitors. Eur J Med Chem76:1-9 (2014) 
 
Proteasome subunit beta type-5
Name:Proteasome subunit beta type-5
Type:Protein
Mol. Mass.:28480.96
Organism:Homo sapiens (Human)
Description:n/a
Residue:263
BDBM50434763
NameBDBM50434763
Synonyms:CHEMBL2385817
TypeSmall organic molecule
Emp. Form.C15H20BN3O4
Mol. Mass.317.148
SMILESCC(C)C[C@H](NC(=O)Cn1ccc2ncccc2c1=O)B(O)O