Reaction Details
TargetProteasome subunit beta type-5
LigandBDBM50007719
Substrate/Competitorn/a
Meas. Tech.ChEMBL_1334922 (CHEMBL3239238)
Ki 560±n/a nM
Citation Scarbaci, KTroiano, VMicale, NEttari, RTamborini, LDi Giovanni, CCerchia, CGrasso, SNovellino, ESchirmeister, TLavecchia, AZappalą, M Identification of a new series of amides as non-covalent proteasome inhibitors. Eur J Med Chem76:1-9 (2014) 
 
Proteasome subunit beta type-5
Name:Proteasome subunit beta type-5
Type:Protein
Mol. Mass.:28480.96
Organism:Homo sapiens (Human)
Description:n/a
Residue:263
BDBM50007719
NameBDBM50007719
Synonyms:CHEMBL3233441
TypeSmall organic molecule
Emp. Form.C15H18BrN3O2
Mol. Mass.352.226
SMILESCC(C)CCNC(=O)Cn1cc(Br)c2ncccc2c1=O