Reaction Details
TargetProteasome subunit beta type-5
LigandBDBM50069989
Substrate/Competitorn/a
Meas. Tech.ChEMBL_1334922 (CHEMBL3239238)
Ki 9.8±n/a nM
Citation Scarbaci, KTroiano, VMicale, NEttari, RTamborini, LDi Giovanni, CCerchia, CGrasso, SNovellino, ESchirmeister, TLavecchia, AZappalą, M Identification of a new series of amides as non-covalent proteasome inhibitors. Eur J Med Chem76:1-9 (2014) 
 
Proteasome subunit beta type-5
Name:Proteasome subunit beta type-5
Type:Protein
Mol. Mass.:28480.96
Organism:Homo sapiens (Human)
Description:n/a
Residue:263
BDBM50069989
NameBDBM50069989
Synonyms:(R)-3-methyl-1-((S)-3-phenyl-2-(pyrazine-2-carboxamido)propanamido)butylboronic acid BORTEZOMIB Dipeptidyl boronic acid derivative N-[(1R)-1-(DIHYDROXYBORYL)-3-METHYLBUTYL]-N-(PYRAZIN-2-YLCARBONYL)-L-PHENYLALANINAMIDE Peptidyl boronic acid derivative Velcade | cid_387447
TypeSmall organic molecule
Emp. Form.C19H25BN4O4
Mol. Mass.384.237
SMILESCC(C)C[C@H](NC(=O)[C@H](Cc1ccccc1)NC(=O)c1cnccn1)B(O)O