Reaction Details
TargetHistone-arginine methyltransferase CARM1
LigandBDBM50388602
Substrate/Competitorn/a
Meas. Tech.ChEMBL_1334937 (CHEMBL3239253)
IC50>400000±n/a nM
Citation Yan, LYan, CQian, KSu, HKofsky-Wofford, SALee, WCZhao, XHo, MCIvanov, IZheng, YG Diamidine compounds for selective inhibition of protein arginine methyltransferase 1. J Med Chem57:2611-22 (2014) 
 
Histone-arginine methyltransferase CARM1
Name:Histone-arginine methyltransferase CARM1
Type:Protein
Mol. Mass.:65855.47
Organism:Homo sapiens (Human)
Description:Q86X55
Residue:608
BDBM50388602
NameBDBM50388602
Synonyms:FURAMIDINE
TypeSmall organic molecule
Emp. Form.C18H16N4O
Mol. Mass.304.3458
SMILESNC(=N)c1ccc(cc1)-c1ccc(o1)-c1ccc(cc1)C(N)=N