Reaction Details
TargetUbiquitin carboxyl-terminal hydrolase 20
LigandBDBM50007790
Substrate/Competitorn/a
Meas. Tech.ChEMBL_1335827 (CHEMBL3239936)
IC50>100000±n/a nM
Citation Báez-Santos, YMBarraza, SJWilson, MWAgius, MPMielech, AMDavis, NMBaker, SCLarsen, SDMesecar, AD X-ray structural and biological evaluation of a series of potent and highly selective inhibitors of human coronavirus papain-like proteases. J Med Chem57:2393-412 (2014) 
 
Ubiquitin carboxyl-terminal hydrolase 20
Name:Ubiquitin carboxyl-terminal hydrolase 20
Type:PROTEIN
Mol. Mass.:101993.90
Organism:Homo sapiens (Human)
Description:ChEMBL_108270
Residue:914
BDBM50007790
NameBDBM50007790
Synonyms:CHEMBL3233814 | med.21724, Compound 169
TypeSmall organic molecule
Emp. Form.C25H27FN2O
Mol. Mass.390.4931
SMILESC[C@@H](N1CCC(CC1)C(=O)NCc1ccc(F)cc1)c1cccc2ccccc12