Reaction Details
TargetReplicase polyprotein 1a
LigandBDBM50007788
Substrate/Competitorn/a
Meas. Tech.ChEMBL_1335833 (CHEMBL3239942)
IC50 46000±n/a nM
Citation Báez-Santos, YMBarraza, SJWilson, MWAgius, MPMielech, AMDavis, NMBaker, SCLarsen, SDMesecar, AD X-ray structural and biological evaluation of a series of potent and highly selective inhibitors of human coronavirus papain-like proteases. J Med Chem57:2393-412 (2014) 
 
Replicase polyprotein 1a
Name:Replicase polyprotein 1a
Type:PROTEIN
Mol. Mass.:451392.15
Organism:Human coronavirus NL63
Description:ChEMBL_108271
Residue:4060
BDBM50007788
NameBDBM50007788
Synonyms:CHEMBL3233809 | med.21724, Compound 167
TypeSmall organic molecule
Emp. Form.C27H31N3O2
Mol. Mass.429.5539
SMILESC[C@@H](N1CCC(CC1)C(=O)NCc1cccc(NC(C)=O)c1)c1cccc2ccccc12