Reaction Details
TargetCasein kinase I isoform delta
LigandBDBM50008359
Substrate/Competitorn/a
Meas. Tech.ChEMBL_1334961 (CHEMBL3239314)
IC50 4370±n/a nM
Citation Salado, IGRedondo, MBello, MLPerez, CLiachko, NFKraemer, BCMiguel, LLecourtois, MGil, CMartinez, APerez, DI Protein kinase CK-1 inhibitors as new potential drugs for amyotrophic lateral sclerosis. J Med Chem57:2755-72 (2014) 
 
Casein kinase I isoform delta
Name:Casein kinase I isoform delta
Type:Enzyme
Mol. Mass.:47356.76
Organism:Homo sapiens (Human)
Description:P48730
Residue:415
BDBM50008359
NameBDBM50008359
Synonyms:CHEMBL3235180
TypeSmall organic molecule
Emp. Form.C16H14N2O2S
Mol. Mass.298.36
SMILESO=C(COCc1ccccc1)Nc1nc2ccccc2s1