Reaction Details
TargetCasein kinase I isoform delta
LigandBDBM50008399
Substrate/Competitorn/a
Meas. Tech.ChEMBL_1334961 (CHEMBL3239314)
IC50 83±n/a nM
Citation Salado, IGRedondo, MBello, MLPerez, CLiachko, NFKraemer, BCMiguel, LLecourtois, MGil, CMartinez, APerez, DI Protein kinase CK-1 inhibitors as new potential drugs for amyotrophic lateral sclerosis. J Med Chem57:2755-72 (2014) 
 
Casein kinase I isoform delta
Name:Casein kinase I isoform delta
Type:Enzyme
Mol. Mass.:47356.76
Organism:Homo sapiens (Human)
Description:P48730
Residue:415
BDBM50008399
NameBDBM50008399
Synonyms:CHEMBL3235535
TypeSmall organic molecule
Emp. Form.C16H13ClN2OS
Mol. Mass.316.805
SMILESCc1ccc2nc(NC(=O)Cc3cccc(Cl)c3)sc2c1