Reaction Details
TargetCasein kinase I isoform delta
LigandBDBM50008511
Substrate/Competitorn/a
Meas. Tech.ChEMBL_1334961 (CHEMBL3239314)
IC50 1430±n/a nM
Citation Salado, IGRedondo, MBello, MLPerez, CLiachko, NFKraemer, BCMiguel, LLecourtois, MGil, CMartinez, APerez, DI Protein kinase CK-1 inhibitors as new potential drugs for amyotrophic lateral sclerosis. J Med Chem57:2755-72 (2014) 
 
Casein kinase I isoform delta
Name:Casein kinase I isoform delta
Type:Enzyme
Mol. Mass.:47356.76
Organism:Homo sapiens (Human)
Description:P48730
Residue:415
BDBM50008511
NameBDBM50008511
Synonyms:CHEMBL3235571
TypeSmall organic molecule
Emp. Form.C20H22N2O5S
Mol. Mass.402.464
SMILESCCOc1ccc2nc(NC(=O)Cc3cc(OC)c(OC)c(OC)c3)sc2c1